{"text_format":"1","workbook":"xlsx","n_sheets":7,"sheets":["Einteilung","Vorrunde Gruppenspiele","Play-off","Modus Play-off","Torschützen U12","Ergebnis","Statistische Daten"],"not_rendered":{"charts":0,"images":8,"macros":1,"external_links":0,"defined_names":6,"comments":0,"pivot_tables":0},"unopened":[],"bounds":{"document_bytes":16777216,"sheet_cells":100000,"rows_first":2000,"rows_last":500,"rows_between":2000,"halvings":0,"cell_chars":16384,"cell_head_chars":4096},"cells_cut":0,"cells_raw":0,"read":"whole","date_system":"1900"}

{"sheet":"Einteilung","index":0,"n_rows":23,"n_cols":13,"rows_kept":23,"cut":false,"hidden":false,"merged":[[0,1,0,7],[10,1,10,3],[3,1,3,3],[17,1,17,3],[1,1,1,7]]}
[]
[null,"U12 - LM"]
[]
[null,"Gruppe I"]
[null,"Team",null,"Trikotfarbe",null,"Turnierbeginn","14:15:00","Uhr"]
[null,"UFC Rohrbach-Berg",null,null,"I","Spieldauer","00:10:00","min"]
[null,"U. Pichling",null,null,"I","Pause","00:02:00","min"]
[null,"U. Altenfelden",null,null,"I","Beginn Playoff",{"$f":"'Play-off'!K6","v":"17:55:00"},"Uhr"]
[null,"U. Walding/Rottenegg",null,null,"I","Turnierende",{"$f":"'Play-off'!R28+Einteilung!G6","v":"20:30:00"},"Uhr",null,null,"Pause Vorrunde","00:02:00","min"]
[]
{"$rows_left_out":14}
{"sheet":"Vorrunde Gruppenspiele","index":1,"n_rows":26,"n_cols":83,"rows_kept":26,"cut":false,"hidden":false,"merged":[[1,80,1,82],[1,76,1,78],[1,41,1,72],[1,1,1,17],[17,1,17,10],[3,41,9,41],[3,1,3,10],[3,14,3,15],[9,1,9,10],[11,1,11,10],[11,14,11,15],[19,41,25,41],[11,41,17,41],[19,1,19,10],[19,14,19,15],[25,1,25,10]]}
[]
[null,"Spielplan Vorrunde U12",null,null,null,null,null,null,null,null,null,null,null,null,null,null,null,null,null,null,null,null,null,null,null,null,null,null,null,null,null,null,null,null,null,null,null,null,null,null,null,"U12",null,null,null,null,null,null,null,null,null,null,null,null,null,null,null,null,null,null,null,null,null,null,null,null,null,null,null,null,null,null,null,null,null,null,"Berechnung für jede Gruppe\ninkl. direktes Duell",null,null,null,"Berechnung für Gruppenvergleich Gruppe 1-3"]
[]
[null,"GRUPPE I",null,null,null,null,null,null,null,null,null,null,"Rd.","Zeit","Ergebnisse GRUPPE I",null,null,null,null,null,null,null,null,null,null,null,null,null,null,null,null,null,null,null,null,null,null,null,null,null,null,"I","Sieger","Verlierer","Remis","Remis","HT","Team","Spiele","S","U","N","+","-","Tordiff.","Punkte","Berechnung","Rang","Hilfswert","Berechnung NEU","Rang",null,"Team","Spiele","S","U","N","+","-","Tordiff.","Punkte","Berechnung","Rang",null,null,null,1,"Gr.","Berechnungs-\npunkte",null,1,"Gr.","Berechnungs-\npunkte"]
[null,"Rg.","Team","Sp.","S","U","N","+","-","Tord.","Pkt.",null,1,{"$f":"Einteilung!G5","v":"14:15:00"},{"$f":"AV5","v":"UFC Rohrbach-Berg"},{"$f":"AV6","v":"U. Pichling"},3,0,"I",{"$f":"Einteilung!B$2","v":"U12 - LM"},null,null,null,null,null,null,null,null,null,null,null,null,null,null,null,null,null,null,null,null,null,null,{"$f":"IF(AND(Q5=\"\",R5=\"\"),\"\",IF(Q5=R5,\"\",IF(Q5>R5,O5,P5)))","v":"UFC Rohrbach-Berg"},{"$f":"IF(AND(Q5=\"\",R5=\"\"),\"\",IF(Q5=R5,\"\",IF(Q5>R5,P5,O5)))","v":"U. Pichling"},{"$f":"IF(AND(Q5=\"\",R5=\"\"),\"\",IF(Q5=R5,O5,\"\"))","v":""},{"$f":"IF(AND(Q5=\"\",R5=\"\"),\"\",IF(Q5=R5,P5,\"\"))","v":""},{"$f":"IF(ISERROR(IF(VLOOKUP(O5,$AV$5:$BI$8,9,0)=VLOOKUP(P5,$AV$5:$BI$8,9,0),IF(Q5>R5,1,IF(Q5=R5,0,-1)),0)),0,IF(VLOOKUP(O5,$AV$5:$BI$8,9,0)=VLOOKUP(P5,$AV$5:$BI$8,9,0),IF(Q5>R5,1,IF(Q5=R5,0,-1)),0))","v":0},{"$f":"Einteilung!B6","v":"UFC Rohrbach-Berg"},{"$f":"SUM(AX5:AZ5)","v":3},{"$f":"COUNTIF($AQ$5:$AQ$10,$AV5)","v":3},{"$f":"COUNTIF($AS$5:$AS$10,$AV5)+COUNTIF($AT$5:$AT$10,$AV5)","v":0},{"$f":"COUNTIF($AR$5:$AR$10,$AV5)","v":0},{"$f":"SUM((O$5:O$10=AV5)*(Q$5:Q$10))+SUM((P$5:P$10=AV5)*(R$5:R$10))","v":12},{"$f":"SUM((O$5:O$10=AV5)*(R$5:R$10))+SUM((P$5:P$10=AV5)*(Q$5:Q$10))","v":0},{"$f":"BA5-BB5","v":12},{"$f":"3*AX5+1*AY5","v":9},{"$f":"BD5*1000000+BC5*1000+BA5*10","v":9012120},null,{"$f":"SUMIF(O:O,AV5,AU:AU)","v":0},{"$f":"BD5*1000000+BC5*1000+BA5*10-AW5/1000+BG5*100000","v":9012119.9969999995},{"$f":"RANK(BH5,BH$5:BH$8,0)","v":1},null,{"$f":"AV$5","v":"UFC Rohrbach-Berg"},3,3,0,0,12,0,12,9,{"$f":"BH$5","v":9012119.9969999995},{"$f":"RANK(BT5,BT$5:BT$8,0)","v":1},null,null,null,{"$f":"BK$5","v":"UFC Rohrbach-Berg"},{"$f":"VLOOKUP(BY5,Einteilung!$B:$E,4,FALSE)","v":"I"},{"$f":"BT$5","v":9012119.9969999995},null,{"$f":"BY$5","v":"UFC Rohrbach-Berg"},{"$f":"BZ$5","v":"I"},{"$f":"VLOOKUP(CC5,AV:BI,10,FALSE)","v":9012120}]
[null,{"$f":"RANK(BT5,BT$5:BT$10,0)","v":1},{"$f":"IF(SUM(D$6:D$11)=0,Einteilung!B6,BK5)","v":"UFC Rohrbach-Berg"},{"$f":"BL5","v":3},3,0,0,12,0,12,9,null,2,{"$f":"N5+Einteilung!G$6+Einteilung!G$7","v":"14:27:00"},{"$f":"AV8","v":"U. Walding/Rottenegg"},{"$f":"AV7","v":"U. Altenfelden"},4,0,"I",{"$f":"Einteilung!B$2","v":"U12 - LM"},null,null,null,null,null,null,null,null,null,null,null,null,null,null,null,null,null,null,null,null,null,null,"U. Walding/Rottenegg","U. Altenfelden","","",{"$f":"IF(ISERROR(IF(VLOOKUP(O6,$AV$5:$BI$8,9,0)=VLOOKUP(P6,$AV$5:$BI$8,9,0),IF(Q6>R6,1,IF(Q6=R6,0,-1)),0)),0,IF(VLOOKUP(O6,$AV$5:$BI$8,9,0)=VLOOKUP(P6,$AV$5:$BI$8,9,0),IF(Q6>R6,1,IF(Q6=R6,0,-1)),0))","v":0},{"$f":"Einteilung!B7","v":"U. Pichling"},{"$f":"SUM(AX6:AZ6)","v":3},{"$f":"COUNTIF($AQ$5:$AQ$10,$AV6)","v":1},{"$f":"COUNTIF($AS$5:$AS$10,$AV6)+COUNTIF($AT$5:$AT$10,$AV6)","v":0},{"$f":"COUNTIF($AR$5:$AR$10,$AV6)","v":2},{"$f":"SUM((O$5:O$10=AV6)*(Q$5:Q$10))+SUM((P$5:P$10=AV6)*(R$5:R$10))","v":4},{"$f":"SUM((O$5:O$10=AV6)*(R$5:R$10))+SUM((P$5:P$10=AV6)*(Q$5:Q$10))","v":6},{"$f":"BA6-BB6","v":-2},{"$f":"3*AX6+1*AY6","v":3},{"$f":"BD6*1000000+BC6*1000+BA6*10","v":2998040},null,{"$f":"SUMIF(O:O,AV6,AU:AU)","v":0},{"$f":"BD6*1000000+BC6*1000+BA6*10-AW6/1000+BG6*100000","v":2998039.997},{"$f":"RANK(BH6,BH$5:BH$8,0)","v":3},null,{"$f":"AV$8","v":"U. Walding/Rottenegg"},3,2,0,1,7,4,3,6,{"$f":"BH$8","v":6003069.9970000004},{"$f":"RANK(BT6,BT$5:BT$8,0)","v":2},null,null,null,{"$f":"BK$21","v":"SPG Julbach/Ulrichsb./Klaffer"},{"$f":"VLOOKUP(BY6,Einteilung!$B:$E,4,FALSE)","v":"III"},{"$f":"BT$21","v":7006069.9970000004},null,{"$f":"BY$6","v":"SPG Julbach/Ulrichsb./Klaffer"},{"$f":"BZ$6","v":"III"},{"$f":"VLOOKUP(CC6,AV:BI,10,FALSE)","v":7006070}]
[null,{"$f":"RANK(BT6,BT$5:BT$10,0)","v":2},{"$f":"IF(SUM(D$6:D$11)=0,Einteilung!B7,BK6)","v":"U. Walding/Rottenegg"},3,2,0,1,7,4,3,6,null,7,{"$f":"N22+Einteilung!G$6+Einteilung!G$7","v":"15:27:00"},{"$f":"AV7","v":"U. Altenfelden"},{"$f":"AV5","v":"UFC Rohrbach-Berg"},0,7,"I",{"$f":"Einteilung!B$2","v":"U12 - LM"},null,null,null,null,null,null,null,null,null,null,null,null,null,null,null,null,null,null,null,null,null,null,"UFC Rohrbach-Berg","U. Altenfelden","","",0,{"$f":"Einteilung!B8","v":"U. Altenfelden"},3,0,0,3,{"$f":"SUM((O$5:O$10=AV7)*(Q$5:Q$10))+SUM((P$5:P$10=AV7)*(R$5:R$10))","v":0},{"$f":"SUM((O$5:O$10=AV7)*(R$5:R$10))+SUM((P$5:P$10=AV7)*(Q$5:Q$10))","v":13},-13,0,-13000,null,{"$f":"SUMIF(O:O,AV7,AU:AU)","v":0},-13000.003000000001,4,null,{"$f":"AV$6","v":"U. Pichling"},3,1,0,2,4,6,-2,3,{"$f":"BH$6","v":2998039.997},{"$f":"RANK(BT7,BT$5:BT$8,0)","v":3},null,null,null,{"$f":"BK$13","v":"U. St. Peter/Wimberg"},{"$f":"VLOOKUP(BY7,Einteilung!$B:$E,4,FALSE)","v":"II"},{"$f":"BT$13","v":7005059.9970000004},null,{"$f":"BY$7","v":"U. St. Peter/Wimberg"},{"$f":"BZ$7","v":"II"},{"$f":"VLOOKUP(CC7,AV:BI,10,FALSE)","v":7005060}]
[null,{"$f":"RANK(BT7,BT$5:BT$10,0)","v":3},{"$f":"IF(SUM(D$6:D$11)=0,Einteilung!B8,BK7)","v":"U. Pichling"},3,1,0,2,4,6,-2,3,null,8,{"$f":"N7+Einteilung!G$6+Einteilung!G$7","v":"15:39:00"},{"$f":"AV8","v":"U. Walding/Rottenegg"},{"$f":"AV6","v":"U. Pichling"},3,2,"I",{"$f":"Einteilung!B$2","v":"U12 - LM"},null,null,null,null,null,null,null,null,null,null,null,null,null,null,null,null,null,null,null,null,null,null,"U. Walding/Rottenegg","U. Pichling","","",0,{"$f":"Einteilung!B9","v":"U. Walding/Rottenegg"},3,2,0,1,{"$f":"SUM((O$5:O$10=AV8)*(Q$5:Q$10))+SUM((P$5:P$10=AV8)*(R$5:R$10))","v":7},{"$f":"SUM((O$5:O$10=AV8)*(R$5:R$10))+SUM((P$5:P$10=AV8)*(Q$5:Q$10))","v":4},3,6,6003070,null,{"$f":"SUMIF(O:O,AV8,AU:AU)","v":0},6003069.9970000004,2,null,{"$f":"AV$7","v":"U. Altenfelden"},3,0,0,3,0,13,-13,0,{"$f":"BH$7","v":-13000.003000000001},{"$f":"RANK(BT8,BT$5:BT$8,0)","v":4}]
[null,{"$f":"RANK(BT8,BT$5:BT$10,0)","v":4},{"$f":"IF(SUM(D$6:D$11)=0,Einteilung!B9,BK8)","v":"U. Altenfelden"},3,0,0,3,0,13,-13,0,null,13,{"$f":"N24+Einteilung!G$6+Einteilung!G$7","v":"16:39:00"},{"$f":"AV5","v":"UFC Rohrbach-Berg"},{"$f":"AV8","v":"U. Walding/Rottenegg"},2,0,"I",{"$f":"Einteilung!B$2","v":"U12 - LM"},null,null,null,null,null,null,null,null,null,null,null,null,null,null,null,null,null,null,null,null,null,null,"UFC Rohrbach-Berg","U. Walding/Rottenegg","","",0,null,null,null,null,null,null,null,null,null,null,null,null,null,null,null,null,null,null,null,null,null,null,null,null,null,null,null,null,null,2,"Gr.","Berechnungs-\npunkte",null,2,"Gr.","Berechnungs-\npunkte"]
[null,{"$f":"IF(AND(SUM(B6:B9)<>10,SUM(D6:D9)=12),\"ACHTUNG Gleichstand --> Penaltyschießen erforderlich !!!\",\"\")","v":""},null,null,null,null,null,null,null,null,null,null,14,{"$f":"N9+Einteilung!G$6+Einteilung!G$7","v":"16:51:00"},{"$f":"AV6","v":"U. Pichling"},{"$f":"AV7","v":"U. Altenfelden"},2,0,"I",{"$f":"Einteilung!B$2","v":"U12 - LM"},null,null,null,null,null,null,null,null,null,null,null,null,null,null,null,null,null,null,null,null,null,null,{"$f":"IF(AND(Q10=\"\",R10=\"\"),\"\",IF(Q10=R10,\"\",IF(Q10>R10,O10,P10)))","v":"U. Pichling"},{"$f":"IF(AND(Q10=\"\",R10=\"\"),\"\",IF(Q10=R10,\"\",IF(Q10>R10,P10,O10)))","v":"U. Altenfelden"},{"$f":"IF(AND(Q10=\"\",R10=\"\"),\"\",IF(Q10=R10,O10,\"\"))","v":""},{"$f":"IF(AND(Q10=\"\",R10=\"\"),\"\",IF(Q10=R10,P10,\"\"))","v":""},0,null,2,3,4,5,6,7,8,9,10,null,null,null,null,null,null,null,null,null,null,null,null,null,null,null,null,null,null,null,{"$f":"BK$14","v":"U. Gampern"},{"$f":"VLOOKUP(BY10,Einteilung!$B:$E,4,FALSE)","v":"II"},{"$f":"BT$14","v":7004049.9970000004},null,{"$f":"BY$10","v":"U. Gampern"},{"$f":"BZ$10","v":"II"},{"$f":"VLOOKUP(CC10,AV:BI,10,FALSE)","v":7004050}]
{"$rows_left_out":17}
{"sheet":"Play-off","index":2,"n_rows":29,"n_cols":31,"rows_kept":29,"cut":false,"hidden":false,"merged":[[23,1,23,7],[14,1,14,7],[3,17,3,20],[5,10,6,10],[14,10,15,10],[18,10,19,10],[22,15,28,15],[13,15,19,15],[12,17,12,20],[14,17,15,17],[16,17,16,20],[25,17,25,20],[27,17,28,17],[23,10,24,10],[27,10,28,10],[23,17,24,17],[18,17,19,17],[20,17,20,20],[0,29,0,30],[4,15,10,15],[2,1,2,7],[5,1,5,7],[9,10,10,10],[9,17,10,17],[5,17,6,17],[7,17,7,20],[0,1,0,20],[2,10,2,13],[2,17,2,20]]}
[null,{"$f":"Einteilung!B2","v":"U12 - LM"},null,null,null,null,null,null,null,null,null,null,null,null,null,null,null,null,null,null,null,null,null,null,null,null,null,null,null,"Ergebnis U12"]
[]
[null,"U12 Vorrunde Gruppenspiele",null,null,null,null,null,null,null,null,"U12 Halbfinale (HF 1-6)",null,null,null,null,null,null,"U12 Final- & Platzierungsspiele"]
[]
[null,null,null,null,null,null,null,null,null,null,"HF 1:    Bester Grp.-Vierter - 2. bester Grp.-Vierter",null,null,null,null,"Ränge 9-12",null,"Spiel um Rg. 11: Verlierer HF 1- Verlierer HF 2"]
[null,"GRUPPE I",null,null,null,null,null,null,null,null,{"$f":"'Vorrunde Gruppenspiele'!N26+Einteilung!G$6+3*Einteilung!G$7","v":"17:55:00"},{"$f":"IF(SUM(D$8:D$30)<36,\"\",'Vorrunde Gruppenspiele'!BY22)","v":"U. Lembach"},1,null,null,null,null,{"$f":"K28+Einteilung!G$6+2*Einteilung!G$7","v":"19:15:00"},{"$f":"IF(M6=\"\",\"\",IF(M6>M7,L7,IF(M6<M7,L6,IF(M6=M7,IF(N6>N7,L7,IF(N6<N7,L6,\"Penalty !!!!!\"))))))","v":"U. Lembach"},2,null,null,null,null,null,null,null,null,null,12,{"$f":"IF(T6=\"\",\"\",IF(T6>T7,S7,IF(T6<T7,S6,IF(T6=T7,IF(U6>U7,S7,IF(U6<U7,S6,\"Penalty !!!!!\"))))))","v":"SPG Putzleinsdorf/Hofkirchen"}]
[null,"Rg.","Team","Sp.","+","-","Tord.","Pkt.",null,null,null,{"$f":"IF(SUM(D$8:D$30)<36,\"\",'Vorrunde Gruppenspiele'!BY23)","v":"U. Altenfelden"},4,null,null,null,null,null,{"$f":"IF(M10=\"\",\"\",IF(M10>M11,L11,IF(M10<M11,L10,IF(M10=M11,IF(N10>N11,L11,IF(N10<N11,L10,\"Penalty !!!!!\"))))))","v":"SPG Putzleinsdorf/Hofkirchen"},0,null,null,null,null,null,null,null,null,null,11,{"$f":"IF(T6=\"\",\"\",IF(T6>T7,S6,IF(T6<T7,S7,IF(T6=T7,IF(U6>U7,S6,IF(U6<U7,S7,\"Penalty !!!!!\"))))))","v":"U. Lembach"}]
[null,1,{"$f":"'Vorrunde Gruppenspiele'!C6","v":"UFC Rohrbach-Berg"},{"$f":"'Vorrunde Gruppenspiele'!D6","v":3},{"$f":"'Vorrunde Gruppenspiele'!H6","v":12},{"$f":"'Vorrunde Gruppenspiele'!I6","v":0},{"$f":"'Vorrunde Gruppenspiele'!J6","v":12},{"$f":"'Vorrunde Gruppenspiele'!K6","v":9},{"$f":"B8","v":1}]
[null,2,{"$f":"'Vorrunde Gruppenspiele'!C7","v":"U. Walding/Rottenegg"},{"$f":"'Vorrunde Gruppenspiele'!D7","v":3},{"$f":"'Vorrunde Gruppenspiele'!H7","v":7},{"$f":"'Vorrunde Gruppenspiele'!I7","v":4},{"$f":"'Vorrunde Gruppenspiele'!J7","v":3},{"$f":"'Vorrunde Gruppenspiele'!K7","v":6},{"$f":"B9","v":2},null,"HF 2 :    3. bester Grp.-Dritter - 3. bester Grp.-Vierter",null,null,null,null,null,null,"Spiel um Rg. 9: Sieger HF 1- Sieger HF 2"]
[null,3,{"$f":"'Vorrunde Gruppenspiele'!C8","v":"U. Pichling"},{"$f":"'Vorrunde Gruppenspiele'!D8","v":3},{"$f":"'Vorrunde Gruppenspiele'!H8","v":4},{"$f":"'Vorrunde Gruppenspiele'!I8","v":6},{"$f":"'Vorrunde Gruppenspiele'!J8","v":-2},{"$f":"'Vorrunde Gruppenspiele'!K8","v":3},3,null,{"$f":"K6+Einteilung!G$6+2*Einteilung!G$7","v":"18:09:00"},{"$f":"IF(SUM(D$8:D$30)<36,\"\",'Vorrunde Gruppenspiele'!BY19)","v":"U. Pichling"},6,null,null,null,null,{"$f":"R6+Einteilung!G$6+Einteilung!G$7","v":"19:27:00"},{"$f":"IF(M6=\"\",\"\",IF(M6>M7,L6,IF(M6<M7,L7,IF(M6=M7,IF(N6>N7,L6,IF(N6<N7,L7,\"Penalty !!!!!\"))))))","v":"U. Altenfelden"},0,null,null,null,null,null,null,null,null,null,10,{"$f":"IF(T10=\"\",\"\",IF(T10>T11,S11,IF(T10<T11,S10,IF(T10=T11,IF(U10>U11,S11,IF(U10<U11,S10,\"Penalty !!!!!\"))))))","v":"U. Altenfelden"}]
{"$rows_left_out":20}
{"sheet":"Modus Play-off","index":3,"n_rows":29,"n_cols":31,"rows_kept":29,"cut":false,"hidden":false,"merged":[[20,17,20,20],[22,15,28,15],[23,1,23,7],[23,10,24,10],[23,17,24,17],[25,17,25,20],[27,10,28,10],[27,17,28,17],[12,17,12,20],[13,15,19,15],[14,1,14,7],[14,10,15,10],[14,17,15,17],[16,17,16,20],[18,10,19,10],[18,17,19,17],[4,15,10,15],[5,1,5,7],[5,10,6,10],[5,17,6,17],[7,17,7,20],[9,10,10,10],[9,17,10,17],[0,29,0,30],[2,1,2,7],[2,10,2,13],[2,17,2,20],[3,17,3,20],[0,1,0,20]]}
[null,"U12",null,null,null,null,null,null,null,null,null,null,null,null,null,null,null,null,null,null,null,null,null,null,null,null,null,null,null,"Ergebnis U12"]
[]
[null,"U12 Vorrunde Gruppenspiele",null,null,null,null,null,null,null,null,"U12 Halbfinale (HF 1-10)",null,null,null,null,null,null,"U12 Final- & Platzierungsspiele"]
[]
[null,null,null,null,null,null,null,null,null,null,"HF 1: Bester Grp.-Vierter - 2. bester Grp.-Vierter",null,null,null,null,"Ränge 9-12",null,"Spiel um Rg. 11: Verlierer HF 1- Verlierer HF 2"]
[null,"GRUPPE I",null,null,null,null,null,null,null,null,"17:55:00",null,null,null,null,null,null,"19:15:00",null,null,null,null,null,null,null,null,null,null,null,12,"U. Walding/Rottenegg"]
[null,"Rg.","Team","Sp.","+","-","Tord.","Pkt.",null,null,null,null,null,null,null,null,null,null,null,null,null,null,null,null,null,null,null,null,null,11,"U. Ried/Riedmark"]
[null,1,null,null,null,null,null,null,1]
[null,2,null,null,null,null,null,null,2,null,"HF 2 : 3. bester Grp.-Dritter - 3. bester Grp.-Vierter",null,null,null,null,null,null,"Spiel um Rg. 9: Sieger HF 1- Sieger HF 2"]
[null,3,null,null,null,null,null,null,3,null,"18:09:00",null,null,null,null,null,null,"19:27:00",null,null,null,null,null,null,null,null,null,null,null,10,"UFC Aigen/Schlägl"]
{"$rows_left_out":20}
{"sheet":"Torschützen U12","index":4,"n_rows":104,"n_cols":31,"rows_kept":104,"cut":false,"hidden":false,"merged":[[0,5,0,16],[4,4,63,4],[2,23,2,26],[2,27,2,30],[2,5,2,8],[2,9,2,12],[2,13,2,16],[2,19,2,22]]}
[null,null,null,null,{"$f":"SUM(F65:Q65)","v":0},"Torschützen"]
[]
[null,null,null,null,null,"Gruppe I",null,null,null,"Gruppe II",null,null,null,"Gruppe III",null,null,null,null,null,"Gruppe I",null,null,null,"Gruppe II",null,null,null,"Gruppe III"]
["Rang","Tore","Anzahl Spieler",null,null,{"$f":"Einteilung!$B6","v":"UFC Rohrbach-Berg"},{"$f":"Einteilung!$B7","v":"U. Pichling"},{"$f":"Einteilung!$B8","v":"U. Altenfelden"},{"$f":"Einteilung!$B9","v":"U. Walding/Rottenegg"},{"$f":"Einteilung!$B13","v":"U. St. Peter/Wimberg"},{"$f":"Einteilung!$B14","v":"U. Gampern"},{"$f":"Einteilung!$B15","v":"UFC Aigen/Schlägl"},{"$f":"Einteilung!$B16","v":"U. Lembach"},{"$f":"Einteilung!$B20","v":"U. St. Martin/Mkr."},{"$f":"Einteilung!$B21","v":"SPG Putzleinsdorf/Hofkirchen"},{"$f":"Einteilung!$B22","v":"SPG Julbach/Ulrichsb./Klaffer"},{"$f":"Einteilung!$B23","v":"U. Ried/Riedmark"},null,"Rückennummer",{"$f":"F4","v":"UFC Rohrbach-Berg"},"U. Pichling","U. Altenfelden","U. Walding/Rottenegg","U. St. Peter/Wimberg","U. Gampern","UFC Aigen/Schlägl","U. Lembach","U. St. Martin/Mkr.","SPG Putzleinsdorf/Hofkirchen","SPG Julbach/Ulrichsb./Klaffer",{"$f":"Q4","v":"U. Ried/Riedmark"}]
[1,{"$f":"IF(LARGE(T$5:AE$104,A5)=0,\"\",LARGE(T$5:AE$104,A5))","v":""},{"$f":"IF(B5=\"\",\"\",COUNTIF(T$5:AE$104,B5))","v":""},null,"RÜCKENNUMMER",null,null,null,null,null,null,null,null,null,null,null,null,1,1,{"$f":"COUNTIF(F$5:F$63,$S5)","v":0},{"$f":"COUNTIF(G$5:G$63,$S5)","v":0},{"$f":"COUNTIF(H$5:H$63,$S5)","v":0},{"$f":"COUNTIF(I$5:I$63,$S5)","v":0},{"$f":"COUNTIF(J$5:J$63,$S5)","v":0},{"$f":"COUNTIF(K$5:K$63,$S5)","v":0},{"$f":"COUNTIF(L$5:L$63,$S5)","v":0},{"$f":"COUNTIF(M$5:M$63,$S5)","v":0},{"$f":"COUNTIF(N$5:N$63,$S5)","v":0},{"$f":"COUNTIF(O$5:O$63,$S5)","v":0},{"$f":"COUNTIF(P$5:P$63,$S5)","v":0},{"$f":"COUNTIF(Q$5:Q$63,$S5)","v":0}]
[{"$f":"IF(B6=\"\",\"\",A5+1)","v":""},{"$f":"IF(B5=\"\",\"\",IF(B5-1<=0,\"\",B5-1))","v":""},"",null,null,null,null,null,null,null,null,null,null,null,null,null,null,2,2,0,0,0,0,0,0,0,0,0,0,0,0]
[{"$f":"IF(B7=\"\",\"\",A6+1)","v":""},"","",null,null,null,null,null,null,null,null,null,null,null,null,null,null,3,3,0,0,0,0,0,0,0,0,0,0,0,0]
[{"$f":"IF(B8=\"\",\"\",A7+1)","v":""},"","",null,null,null,null,null,null,null,null,null,null,null,null,null,null,4,4,0,0,0,0,0,0,0,0,0,0,0,0]
["","","",null,null,null,null,null,null,null,null,null,null,null,null,null,null,5,5,0,0,0,0,0,0,0,0,0,0,0,0]
["","","",null,null,null,null,null,null,null,null,null,null,null,null,null,null,6,6,0,0,0,0,0,0,0,0,0,0,0,0]
{"$rows_left_out":95}
{"sheet":"Ergebnis","index":5,"n_rows":17,"n_cols":7,"rows_kept":17,"cut":false,"hidden":false,"merged":[[0,5,0,6],[2,1,2,6]]}
[null,null,null,null,null,"2025-01-04"]
[]
[null,"Ergebnisliste U12 Sportunion - Landesmeisterschaft"]
[]
[null,"Rang","Team","Final-\nspiel","Pen.","Gruppe","Rang Gr."]
[null,1,{"$f":"'Play-off'!AE29","v":"UFC Rohrbach-Berg"},{"$f":"IF(ISERROR(VLOOKUP(C6,'Play-off'!S:U,2,FALSE)),VLOOKUP(C6,'Play-off'!S:U,3,FALSE),VLOOKUP(C6,'Play-off'!S:U,2,FALSE))","v":3},{"$f":"IF(IF(ISERROR(VLOOKUP(C6,'Play-off'!$S:$U,3,FALSE)),VLOOKUP(C6,'Play-off'!$S:$U,2,FALSE),VLOOKUP(C6,'Play-off'!$S:$U,3,FALSE))=\"\",\"\",IF(ISERROR(VLOOKUP(C6,'Play-off'!$S:$U,3,FALSE)),VLOOKUP(C6,'Play-off'!$S:$U,2,FALSE),VLOOKUP(C6,'Play-off'!$S:$U,3,FALSE)))","v":""},{"$f":"IF(C6=\"\",\"\",IF(ISERROR(VLOOKUP(C6,Einteilung!B:E,4,FALSE)),VLOOKUP(C6,Einteilung!F:I,4,FALSE),VLOOKUP(C6,Einteilung!B:E,4,FALSE)))","v":"I"},{"$f":"IF(C6=\"\",\"\",VLOOKUP(C6,'Play-off'!C:K,7,FALSE))","v":1}]
[null,2,{"$f":"'Play-off'!AE28","v":"U. St. Peter/Wimberg"},{"$f":"IF(ISERROR(VLOOKUP(C7,'Play-off'!S:U,2,FALSE)),VLOOKUP(C7,'Play-off'!S:U,3,FALSE),VLOOKUP(C7,'Play-off'!S:U,2,FALSE))","v":1},{"$f":"IF(IF(ISERROR(VLOOKUP(C7,'Play-off'!$S:$U,3,FALSE)),VLOOKUP(C7,'Play-off'!$S:$U,2,FALSE),VLOOKUP(C7,'Play-off'!$S:$U,3,FALSE))=\"\",\"\",IF(ISERROR(VLOOKUP(C7,'Play-off'!$S:$U,3,FALSE)),VLOOKUP(C7,'Play-off'!$S:$U,2,FALSE),VLOOKUP(C7,'Play-off'!$S:$U,3,FALSE)))","v":""},{"$f":"IF(C7=\"\",\"\",IF(ISERROR(VLOOKUP(C7,Einteilung!B:E,4,FALSE)),VLOOKUP(C7,Einteilung!F:I,4,FALSE),VLOOKUP(C7,Einteilung!B:E,4,FALSE)))","v":"II"},{"$f":"IF(C7=\"\",\"\",VLOOKUP(C7,'Play-off'!C:K,7,FALSE))","v":1}]
[null,3,{"$f":"'Play-off'!AE25","v":"U. Gampern"},{"$f":"IF(ISERROR(VLOOKUP(C8,'Play-off'!S:U,2,FALSE)),VLOOKUP(C8,'Play-off'!S:U,3,FALSE),VLOOKUP(C8,'Play-off'!S:U,2,FALSE))","v":1},{"$f":"IF(IF(ISERROR(VLOOKUP(C8,'Play-off'!$S:$U,3,FALSE)),VLOOKUP(C8,'Play-off'!$S:$U,2,FALSE),VLOOKUP(C8,'Play-off'!$S:$U,3,FALSE))=\"\",\"\",IF(ISERROR(VLOOKUP(C8,'Play-off'!$S:$U,3,FALSE)),VLOOKUP(C8,'Play-off'!$S:$U,2,FALSE),VLOOKUP(C8,'Play-off'!$S:$U,3,FALSE)))","v":3},{"$f":"IF(C8=\"\",\"\",IF(ISERROR(VLOOKUP(C8,Einteilung!B:E,4,FALSE)),VLOOKUP(C8,Einteilung!F:I,4,FALSE),VLOOKUP(C8,Einteilung!B:E,4,FALSE)))","v":"II"},{"$f":"IF(C8=\"\",\"\",VLOOKUP(C8,'Play-off'!C:K,7,FALSE))","v":2}]
[null,4,{"$f":"'Play-off'!AE24","v":"SPG Julbach/Ulrichsb./Klaffer"},{"$f":"IF(ISERROR(VLOOKUP(C9,'Play-off'!S:U,2,FALSE)),VLOOKUP(C9,'Play-off'!S:U,3,FALSE),VLOOKUP(C9,'Play-off'!S:U,2,FALSE))","v":1},{"$f":"IF(IF(ISERROR(VLOOKUP(C9,'Play-off'!$S:$U,3,FALSE)),VLOOKUP(C9,'Play-off'!$S:$U,2,FALSE),VLOOKUP(C9,'Play-off'!$S:$U,3,FALSE))=\"\",\"\",IF(ISERROR(VLOOKUP(C9,'Play-off'!$S:$U,3,FALSE)),VLOOKUP(C9,'Play-off'!$S:$U,2,FALSE),VLOOKUP(C9,'Play-off'!$S:$U,3,FALSE)))","v":1},{"$f":"IF(C9=\"\",\"\",IF(ISERROR(VLOOKUP(C9,Einteilung!B:E,4,FALSE)),VLOOKUP(C9,Einteilung!F:I,4,FALSE),VLOOKUP(C9,Einteilung!B:E,4,FALSE)))","v":"III"},{"$f":"IF(C9=\"\",\"\",VLOOKUP(C9,'Play-off'!C:K,7,FALSE))","v":1}]
[null,5,{"$f":"'Play-off'!AE20","v":"U. Walding/Rottenegg"},{"$f":"IF(ISERROR(VLOOKUP(C10,'Play-off'!S:U,2,FALSE)),VLOOKUP(C10,'Play-off'!S:U,3,FALSE),VLOOKUP(C10,'Play-off'!S:U,2,FALSE))","v":4},{"$f":"IF(IF(ISERROR(VLOOKUP(C10,'Play-off'!$S:$U,3,FALSE)),VLOOKUP(C10,'Play-off'!$S:$U,2,FALSE),VLOOKUP(C10,'Play-off'!$S:$U,3,FALSE))=\"\",\"\",IF(ISERROR(VLOOKUP(C10,'Play-off'!$S:$U,3,FALSE)),VLOOKUP(C10,'Play-off'!$S:$U,2,FALSE),VLOOKUP(C10,'Play-off'!$S:$U,3,FALSE)))","v":""},{"$f":"IF(C10=\"\",\"\",IF(ISERROR(VLOOKUP(C10,Einteilung!B:E,4,FALSE)),VLOOKUP(C10,Einteilung!F:I,4,FALSE),VLOOKUP(C10,Einteilung!B:E,4,FALSE)))","v":"I"},{"$f":"IF(C10=\"\",\"\",VLOOKUP(C10,'Play-off'!C:K,7,FALSE))","v":2}]
{"$rows_left_out":8}
{"sheet":"Statistische Daten","index":6,"n_rows":8,"n_cols":3,"rows_kept":8,"cut":false,"hidden":false,"merged":[[4,1,4,2],[1,1,1,2],[2,1,2,2]]}
[]
[null,"Spiele"]
[null,{"$f":"SUM('Play-off'!D:D)/2+COUNT('Play-off'!M:M)/2+COUNT('Play-off'!T:T)/2","v":30}]
[]
[null,"Erzielte Tore"]
[null,"Vorrunde",{"$f":"SUM('Play-off'!E:E)","v":58}]
[null,"Playoff",{"$f":"SUM('Play-off'!M:M)+SUM('Play-off'!T:T)","v":42}]
[null,"Gesamt",{"$f":"SUM(C6:C7)","v":100}]